{"text_format":"1","workbook":"xlsx","n_sheets":2,"sheets":["Main","settings"],"not_rendered":{"charts":0,"images":0,"macros":1,"external_links":0,"defined_names":4,"comments":0,"pivot_tables":0},"unopened":[],"bounds":{"document_bytes":16777216,"sheet_cells":100000,"rows_first":2000,"rows_last":500,"rows_between":2000,"halvings":0,"cell_chars":16384,"cell_head_chars":4096},"cells_cut":0,"cells_raw":0,"read":"whole","date_system":"1900"}

{"sheet":"Main","index":0,"n_rows":10,"n_cols":11,"rows_kept":10,"cut":false,"hidden":false,"merged":[[1,0,2,0],[3,0,4,0]]}
[null,null,null,null,null,null,"Доступные карты (список можно дополнять)","Доступные игроки (список можно дополнять)",null,"Цвет фона:"]
["HOST","Никнейм",null,null,null,null,"Bizarro","Shnurov_hl"]
[null,"Раса","Неизвестно/Random",null,null,null,"Circle of life","Falcaut2",null,"Цвет текста:","TEST"]
["JOIN","Никнейм",null,null,null,null,"Eldorado","Mordaunt555"]
[null,"Раса","Неизвестно/Random",null,null,null,"Heart of Winter","Oxygen_hl",null,"Имя для стрима","About this game"]
[null,"Карта",null,null,null,null,"Iron Man","CTPAHHuK"]
[null,"Произвольное поле (не более 37 символов)",null,null,null,null,"Plains of Despair","Bulya256"]
[null,"Игровой день","1-1",null,null,null,"Power Spot"]
[null,null,null,null,null,null,"Spleen"]
[null,null,null,null,null,null,"Corona"]

{"sheet":"settings","index":1,"n_rows":42,"n_cols":15,"rows_kept":42,"cut":false,"hidden":true,"merged":[]}
["1-1","1-2","Неизвестно/Random",0,null,"Next Day:",{"$f":"IF(H1,\"1-1\",VLOOKUP(Main!C8,settings!A:B,2,FALSE))","v":"1-2"},{"$f":"ISBLANK(Main!C8)","v":false},null,null,"Никнейм",{"$f":"IF(M1,\"???\",Main!C2)","v":"???"},{"$f":"ISBLANK(Main!C2)","v":true}]
["1-2","1-3","Жизнь/ Life",1,null,null,null,null,null,null,"Раса",{"$f":"IF(O2,0,N2)","v":0},{"$f":"ISBLANK(Main!C3)","v":false},{"$f":"IF(M2,D1,VLOOKUP(Main!C3,settings!C:D,2,FALSE))","v":0},{"$f":"ISERROR(N2)","v":false}]
["1-3","1-4","Природа/ Nature",2,null,null,null,null,null,null,"Никнейм",{"$f":"IF(M3,\"???\",Main!C4)","v":"???"},{"$f":"ISBLANK(Main!C4)","v":true}]
["1-4","1-5","Хаос/ Chaos",3,null,null,null,null,null,null,"Раса",{"$f":"IF(O4,0,N4)","v":0},{"$f":"ISBLANK(Main!C5)","v":false},{"$f":"IF(M4,D1,VLOOKUP(Main!C5,settings!C:D,2,FALSE))","v":0},{"$f":"ISERROR(N4)","v":false}]
["1-5","1-6","Смерть/ Necropolis",4,null,null,null,null,null,null,"Карта",{"$f":"IF(M5,\"???\",Main!C6)","v":"???"},{"$f":"ISBLANK(Main!C6)","v":true}]
["1-6","1-7","Порядок/ Order",5,null,null,null,null,null,null,"Произвольное поле (не более 33 символов)",{"$f":"IF(M6,\"Heroes 4\",Main!C7)","v":"Heroes 4"},{"$f":"ISBLANK(Main!C7)","v":true}]
["1-7","2-1","Барб/ Barbarian",6,null,null,null,null,null,null,"Игровой день",{"$f":"IF(M7,\"???\",Main!C8)","v":"1-1"},{"$f":"ISBLANK(Main!C8)","v":false}]
["2-1","2-2"]
["2-2","2-3"]
["2-3","2-4"]
["2-4","2-5"]
["2-5","2-6"]
["2-6","2-7"]
["2-7","3-1"]
["3-1","3-2"]
["3-2","3-3"]
["3-3","3-4"]
["3-4","3-5"]
["3-5","3-6"]
["3-6","3-7"]
["3-7","4-1"]
["4-1","4-2"]
["4-2","4-3"]
["4-3","4-4"]
["4-4","4-5"]
["4-5","4-6"]
["4-6","4-7"]
["4-7","5-1"]
["5-1","5-2"]
["5-2","5-3"]
["5-3","5-4"]
["5-4","5-5"]
["5-5","5-6"]
["5-6","5-7"]
["5-7","6-1"]
["6-1","6-2"]
["6-2","6-3"]
["6-3","6-4"]
["6-4","6-5"]
["6-5","6-6"]
["6-6","6-7"]
["6-7","1-1"]